{"text_format":"1","workbook":"xlsx","n_sheets":14,"sheets":["✅","TTCty","TKKT","CTBC","CTTM","Map mã","Dòng tiền","Tập đoàn","Vốn vay","Khác","↓","Công ty","~ctbc","~cttm"],"not_rendered":{"charts":0,"images":0,"macros":1,"external_links":1,"defined_names":24,"comments":2,"pivot_tables":0},"unopened":[],"bounds":{"document_bytes":16777216,"sheet_cells":100000,"rows_first":2000,"rows_last":500,"rows_between":2000,"halvings":0,"cell_chars":16384,"cell_head_chars":4096},"cells_cut":0,"cells_raw":0,"read":"whole","date_system":"1900"}

{"sheet":"✅","index":0,"n_rows":28,"n_cols":4,"rows_kept":28,"cut":false,"hidden":false,"merged":[[0,0,3,0]]}
["Tasco Group"]
[]
[null,null,"CẤU HÌNH"]
[]
["BCTC hợp nhất",null,"Tham số","Giá trị"]
[null,null,"Chọn mã có tên",true]
[]
["Tập đoàn"]
[]
["Danh mục công ty"]
{"$rows_left_out":19}
{"sheet":"TTCty","index":1,"n_rows":179,"n_cols":12,"rows_kept":179,"cut":false,"hidden":false,"merged":[[0,0,3,0]]}
[{"$f":"'✅'!A1","v":"Tasco Group"},null,{"$f":"Range2(L_CT2[MÃ])","v":"C6:C179"}]
[]
[null,null,{"$f":"COUNTA(L_CT2[MÃ])","v":174},null,"THÔNG TIN CÔNG TY"]
[null,null,"⏬",null,null,null,null,null,null,null,null,"Kiểm tra trùng"]
["BCTC hợp nhất",null,"MÃ","TÊN THEO DANH SÁCH","TÊN CÔNG TY","ĐỊA CHỈ","NGÀNH NGHỀ KINH DOANH","COMPANY NAME","ADDRESS","BUSINESS SECTOR",null,"MÃ"]
[null,null,"100_",{"$f":"IFERROR(_xlfn.XLOOKUP(L_CT2[[#This Row],[MÃ]],L_CTY[MÃ],L_CTY[TÊN CÔNG TY]),\"-\")","v":"Công ty CP Tasco"},"Công ty CP Tasco","Hà Nội","Dịch vụ thương mại","Tasco JSC","Ha Noi","Commercial services",null,{"$f":"_Trùng(L_CT2[MÃ])","v":"null"}]
[null,null,"173_",{"$f":"IFERROR(_xlfn.XLOOKUP(L_CT2[[#This Row],[MÃ]],L_CTY[MÃ],L_CTY[TÊN CÔNG TY]),\"-\")","v":"Công ty CP VETC"},"Công ty CP VETC","Hà Nội","Dịch vụ","VETC Joint Stock Company","Ha Noi","Services"]
["Tập đoàn",null,"186_",{"$f":"IFERROR(_xlfn.XLOOKUP(L_CT2[[#This Row],[MÃ]],L_CTY[MÃ],L_CTY[TÊN CÔNG TY]),\"-\")","v":"Công ty TNHH Tasco Land"},"Công ty TNHH Tasco Land","Hà Nội","Bất động sản","Tasco Land Co., Ltd","Ha Noi","Property"]
[null,null,"114_",{"$f":"IFERROR(_xlfn.XLOOKUP(L_CT2[[#This Row],[MÃ]],L_CTY[MÃ],L_CTY[TÊN CÔNG TY]),\"-\")","v":"Công ty TNHH Bảo hiểm Tasco"},"Công ty TNHH Bảo hiểm Tasco","Hà Nội","Bảo hiểm phi nhân thọ","Tasco Insurance Co., Ltd","Ha Noi","Non-life insurance"]
["Danh mục công ty",null,"185_",{"$f":"IFERROR(_xlfn.XLOOKUP(L_CT2[[#This Row],[MÃ]],L_CTY[MÃ],L_CTY[TÊN CÔNG TY]),\"-\")","v":"Công ty TNHH MTV Tasco BOT"},"Công ty TNHH MTV Tasco BOT","Hà Nội","Hạ tầng giao thông","Tasco BOT MTV Co., Ltd","Ha Noi","Transportation infrastructure"]
{"$rows_left_out":170}
{"sheet":"TKKT","index":2,"n_rows":181,"n_cols":10,"rows_kept":181,"cut":false,"hidden":false,"merged":[[0,0,3,0]]}
[{"$f":"'✅'!A1","v":"Tasco Group"}]
[]
[null,null,null,"TÀI KHOẢN KẾ TOÁN"]
[]
[{"$f":"'Công ty'!A5","v":"BCTC hợp nhất"},null,"MÃ TK","Tên tài khoản","±","Loại","Mã FS","Tên chỉ tiêu BCTC",null,"Trùng"]
[null,null,"111_","Tiền mặt",1,"BS","111_",{"$f":"_xlfn.XLOOKUP(L_TB[[#This Row],[Mã FS]],L_FS[MÃ],L_FS[CHỈ TIÊU],\"-\")","v":"Tiền"},null,{"$f":"_Trùng(L_TB[MÃ TK])","v":"null"}]
[null,null,"112_","Tiền gửi ngân hàng, các tổ chức tín dụng",1,"BS","111_",{"$f":"_xlfn.XLOOKUP(L_TB[[#This Row],[Mã FS]],L_FS[MÃ],L_FS[CHỈ TIÊU],\"-\")","v":"Tiền"}]
["Tập đoàn",null,"113_","Tiền đang chuyển",1,"BS","111_",{"$f":"_xlfn.XLOOKUP(L_TB[[#This Row],[Mã FS]],L_FS[MÃ],L_FS[CHỈ TIÊU],\"-\")","v":"Tiền"}]
[null,null,"121_","Chứng khoán kinh doanh",1,"BS","121_",{"$f":"_xlfn.XLOOKUP(L_TB[[#This Row],[Mã FS]],L_FS[MÃ],L_FS[CHỈ TIÊU],\"-\")","v":"Chứng khoán kinh doanh"}]
["Danh mục công ty",null,"1281_","Tiền gửi có kỳ hạn",1,"BS","123_",{"$f":"_xlfn.XLOOKUP(L_TB[[#This Row],[Mã FS]],L_FS[MÃ],L_FS[CHỈ TIÊU],\"-\")","v":"Đầu tư nắm giữ đến ngày đáo hạn ngắn hạn"}]
{"$rows_left_out":172}
{"sheet":"CTBC","index":3,"n_rows":122,"n_cols":15,"rows_kept":122,"cut":false,"hidden":false,"merged":[[0,0,3,0]]}
[{"$f":"'✅'!A1","v":"Tasco Group"},null,{"$f":"Range2(L_FS[KC])","v":"H6:H122"}]
[null,null,null,null,null,null,"Hạch toán",null,null,"Vay và nợ nội bộ"]
[null,null,null,"CHỈ TIÊU BÁO CÁO TÀI CHÍNH",null,null,null,"Kết chuyển",null,null,"Giao dịch nội bộ"]
[null,null,null,null,null,null,"⏬","⏬","⏬","⏬","⏬","⏬"]
[{"$f":"'Công ty'!A5","v":"BCTC hợp nhất"},null,"MÃ","CHỈ TIÊU","PL","BS","HT","KC","KHOẢN MỤC","BSⁿ","PLⁿ","MÃ TM","CHỈ TIÊU THUYẾT MINH",null,"Mã trùng"]
[null,null,"000_",{"$f":"_xlfn.XLOOKUP(L_FS[[#This Row],[MÃ]],'~ctbc'!C:C,'~ctbc'!D:D)","v":"Tài khoản ngoại bảng"},0,0,true,"000_","_",null,null,{"$f":"_xlfn.LET(_xlpm.a,_xlfn.TEXTJOIN(\";\",TRUE,IF((L_Map[MÃ BC]=L_FS[[#This Row],[MÃ]]),L_Map[MÃ TM],\"\")),IF(LEN(_xlpm.a)>1,_xlpm.a,\"\"))","v":""},{"$f":"_xlfn.TEXTJOIN(\"; \",TRUE,IF((L_Map[MÃ BC]=L_FS[[#This Row],[MÃ]])*(L_Map[BCR]=0),L_Map[CHỈ TIÊU THUYẾT MINH],\"\"))","v":""},null,{"$f":"IFERROR(_xlfn.LET(_xlpm.i,L_FS[MÃ],_xlfn._xlws.FILTER(_xlfn.UNIQUE(_xlpm.i),COUNTIF(_xlpm.i,_xlfn.UNIQUE(_xlpm.i))>1)),\"null\")","v":"null"}]
[null,null,"001_",{"$f":"_xlfn.XLOOKUP(L_FS[[#This Row],[MÃ]],'~ctbc'!C:C,'~ctbc'!D:D)","v":"Doanh thu bán hàng & cung cấp dịch vụ"},1,0,true,"42b_","KQKD",null,true,{"$f":"_xlfn.LET(_xlpm.a,_xlfn.TEXTJOIN(\";\",TRUE,IF((L_Map[MÃ BC]=L_FS[[#This Row],[MÃ]]),L_Map[MÃ TM],\"\")),IF(LEN(_xlpm.a)>1,_xlpm.a,\"\"))","v":"311_"},{"$f":"_xlfn.TEXTJOIN(\"; \",TRUE,IF((L_Map[MÃ BC]=L_FS[[#This Row],[MÃ]])*(L_Map[BCR]=0),L_Map[CHỈ TIÊU THUYẾT MINH],\"\"))","v":"Doanh thu bán hàng"}]
["Tập đoàn",null,"002_",{"$f":"_xlfn.XLOOKUP(L_FS[[#This Row],[MÃ]],'~ctbc'!C:C,'~ctbc'!D:D)","v":"Các khoản giảm trừ"},-1,0,true,"42b_","KQKD",null,true,{"$f":"_xlfn.LET(_xlpm.a,_xlfn.TEXTJOIN(\";\",TRUE,IF((L_Map[MÃ BC]=L_FS[[#This Row],[MÃ]]),L_Map[MÃ TM],\"\")),IF(LEN(_xlpm.a)>1,_xlpm.a,\"\"))","v":"312_"},{"$f":"_xlfn.TEXTJOIN(\"; \",TRUE,IF((L_Map[MÃ BC]=L_FS[[#This Row],[MÃ]])*(L_Map[BCR]=0),L_Map[CHỈ TIÊU THUYẾT MINH],\"\"))","v":"Giảm trừ doanh thu"}]
[null,null,"011_",{"$f":"_xlfn.XLOOKUP(L_FS[[#This Row],[MÃ]],'~ctbc'!C:C,'~ctbc'!D:D)","v":"Giá vốn hàng bán"},-1,0,true,"42b_","KQKD",null,true,{"$f":"_xlfn.LET(_xlpm.a,_xlfn.TEXTJOIN(\";\",TRUE,IF((L_Map[MÃ BC]=L_FS[[#This Row],[MÃ]]),L_Map[MÃ TM],\"\")),IF(LEN(_xlpm.a)>1,_xlpm.a,\"\"))","v":"320_;370_"},{"$f":"_xlfn.TEXTJOIN(\"; \",TRUE,IF((L_Map[MÃ BC]=L_FS[[#This Row],[MÃ]])*(L_Map[BCR]=0),L_Map[CHỈ TIÊU THUYẾT MINH],\"\"))","v":"Giá vốn hàng bán; Chi phí SXKD theo yếu tố"}]
["Danh mục công ty",null,"021_",{"$f":"_xlfn.XLOOKUP(L_FS[[#This Row],[MÃ]],'~ctbc'!C:C,'~ctbc'!D:D)","v":"Lãi/lỗ bán, thanh lý BĐS đầu tư"},1,0,true,"42b_","KQKD",null,true,{"$f":"_xlfn.LET(_xlpm.a,_xlfn.TEXTJOIN(\";\",TRUE,IF((L_Map[MÃ BC]=L_FS[[#This Row],[MÃ]]),L_Map[MÃ TM],\"\")),IF(LEN(_xlpm.a)>1,_xlpm.a,\"\"))","v":""},{"$f":"_xlfn.TEXTJOIN(\"; \",TRUE,IF((L_Map[MÃ BC]=L_FS[[#This Row],[MÃ]])*(L_Map[BCR]=0),L_Map[CHỈ TIÊU THUYẾT MINH],\"\"))","v":""},null,{"$f":"_Trùng(L_FS[MÃ])","v":"null"}]
{"$rows_left_out":113}
{"sheet":"CTTM","index":4,"n_rows":109,"n_cols":17,"rows_kept":109,"cut":false,"hidden":false,"merged":[[0,0,3,0]]}
[{"$f":"'✅'!A1","v":"Tasco Group"}]
[]
[null,null,"NHÓM THUYẾT MINH",null,null,null,"CHỈ TIÊU THUYẾT MINH BCTC"]
[null,null,null,null,null,null,"(mã x: Chỉ cho BCTC riêng, (*): ghi bằng số âm)","⏬","⏬","Hệ số","BC riêng","Thuyết minh dự phòng"]
[{"$f":"'Công ty'!A5","v":"BCTC hợp nhất"},null,"NH TM","TÊN NHÓM TM",null,"MÃ","CHỈ TIÊU","KHOẢN MỤC","NHÓM","HS","BCR","TMDP","SL link","CTBC đã link","Tên CTBC đã link",null,"Kiểm tra trùng"]
[null,null,"N1","Tài sản và nợ",null,"010_",{"$f":"_xlfn.XLOOKUP(L_TM[[#This Row],[MÃ]],'~cttm'!C:C,'~cttm'!D:D)","v":"Tiền và tương đương tiền"},"TS ngắn","N1",1,null,null,{"$f":"COUNTIFS(L_Map[MÃ TM],L_TM[[#This Row],[MÃ]])","v":2},{"$f":"_xlfn.TEXTJOIN(\";\",TRUE,IF(L_Map[MÃ TM]=L_TM[[#This Row],[MÃ]],L_Map[MÃ BC],\"\"))","v":"111_;112_"},{"$f":"_xlfn.TEXTJOIN(\"; \",TRUE,IF(L_Map[MÃ TM]=L_TM[[#This Row],[MÃ]],L_Map[CHỈ TIÊU BÁO CÁO],\"\"))","v":"Tiền; Các khoản tương đương tiền"},null,{"$f":"_Trùng(L_TM[MÃ])","v":"null"}]
[null,null,"N2","Tài sản cố định",null,"021_",{"$f":"_xlfn.XLOOKUP(L_TM[[#This Row],[MÃ]],'~cttm'!C:C,'~cttm'!D:D)","v":"Đầu tư nắm giữ đến ngày đáo hạn ngắn hạn"},"TS ngắn","N1",1,null,null,{"$f":"COUNTIFS(L_Map[MÃ TM],L_TM[[#This Row],[MÃ]])","v":1},{"$f":"_xlfn.TEXTJOIN(\";\",TRUE,IF(L_Map[MÃ TM]=L_TM[[#This Row],[MÃ]],L_Map[MÃ BC],\"\"))","v":"123_"},{"$f":"_xlfn.TEXTJOIN(\"; \",TRUE,IF(L_Map[MÃ TM]=L_TM[[#This Row],[MÃ]],L_Map[CHỈ TIÊU BÁO CÁO],\"\"))","v":"Đầu tư nắm giữ đến ngày đáo hạn ngắn hạn"}]
["Tập đoàn",null,"N3","Vốn vay",null,"022_",{"$f":"_xlfn.XLOOKUP(L_TM[[#This Row],[MÃ]],'~cttm'!C:C,'~cttm'!D:D)","v":"Đầu tư nắm giữ đến ngày đáo hạn dài hạn"},"TS dài","N1",1,null,null,{"$f":"COUNTIFS(L_Map[MÃ TM],L_TM[[#This Row],[MÃ]])","v":1},{"$f":"_xlfn.TEXTJOIN(\";\",TRUE,IF(L_Map[MÃ TM]=L_TM[[#This Row],[MÃ]],L_Map[MÃ BC],\"\"))","v":"265_"},{"$f":"_xlfn.TEXTJOIN(\"; \",TRUE,IF(L_Map[MÃ TM]=L_TM[[#This Row],[MÃ]],L_Map[CHỈ TIÊU BÁO CÁO],\"\"))","v":"Đầu tư nắm giữ đến ngày đáo hạn dài hạn"}]
[null,null,"N4","Vốn chủ sở hữu",null,"023_",{"$f":"_xlfn.XLOOKUP(L_TM[[#This Row],[MÃ]],'~cttm'!C:C,'~cttm'!D:D)","v":"Đầu tư vào công ty con"},"TS dài","N1",1,null,null,{"$f":"COUNTIFS(L_Map[MÃ TM],L_TM[[#This Row],[MÃ]])","v":1},{"$f":"_xlfn.TEXTJOIN(\";\",TRUE,IF(L_Map[MÃ TM]=L_TM[[#This Row],[MÃ]],L_Map[MÃ BC],\"\"))","v":"261_"},{"$f":"_xlfn.TEXTJOIN(\"; \",TRUE,IF(L_Map[MÃ TM]=L_TM[[#This Row],[MÃ]],L_Map[CHỈ TIÊU BÁO CÁO],\"\"))","v":"Đầu tư vào công ty con"}]
["Danh mục công ty",null,"N5","Doanh thu chi phí",null,"024_",{"$f":"_xlfn.XLOOKUP(L_TM[[#This Row],[MÃ]],'~cttm'!C:C,'~cttm'!D:D)","v":"Đầu tư vào công ty liên kết"},"TS dài","N1",1,null,null,{"$f":"COUNTIFS(L_Map[MÃ TM],L_TM[[#This Row],[MÃ]])","v":1},{"$f":"_xlfn.TEXTJOIN(\";\",TRUE,IF(L_Map[MÃ TM]=L_TM[[#This Row],[MÃ]],L_Map[MÃ BC],\"\"))","v":"262_"},{"$f":"_xlfn.TEXTJOIN(\"; \",TRUE,IF(L_Map[MÃ TM]=L_TM[[#This Row],[MÃ]],L_Map[CHỈ TIÊU BÁO CÁO],\"\"))","v":"Đầu tư vào công ty liên doanh, liên kết"}]
{"$rows_left_out":100}
{"sheet":"Map mã","index":5,"n_rows":116,"n_cols":9,"rows_kept":116,"cut":false,"hidden":false,"merged":[[0,0,3,0]]}
[{"$f":"'✅'!A1","v":"Tasco Group"},null,{"$f":"Range2(L_Map[MÃ BC],L_Map[MÃ TM])","v":"C6:C116,E6:E116"}]
[]
[null,null,null,null,null,null,null,"MAP MÃ CHỈ TIÊU BCTC VÀ THUYẾT MINH"]
[null,null,"⏬",null,"⏬"]
[{"$f":"'Công ty'!A5","v":"BCTC hợp nhất"},null,"MÃ BC","¹","MÃ TM","²","BCR","CHỈ TIÊU BÁO CÁO","CHỈ TIÊU THUYẾT MINH"]
[null,null,"001_",{"$f":"IF(L_Map[[#This Row],[MÃ BC]]<>\"\",COUNTIFS(L_Map[MÃ BC],L_Map[[#This Row],[MÃ BC]]),0)","v":1},"311_",{"$f":"IF(L_Map[[#This Row],[MÃ TM]]<>\"\",COUNTIFS(L_Map[MÃ TM],L_Map[[#This Row],[MÃ TM]]),0)","v":1},{"$f":"IF(_xlfn.XLOOKUP(L_Map[[#This Row],[MÃ TM]],L_TM[MÃ],L_TM[BCR],0),1,0)","v":0},{"$f":"_xlfn.XLOOKUP(L_Map[[#This Row],[MÃ BC]],L_FS[MÃ],L_FS[CHỈ TIÊU],\"-\")","v":"Doanh thu bán hàng & cung cấp dịch vụ"},{"$f":"_xlfn.XLOOKUP(L_Map[[#This Row],[MÃ TM]],L_TM[MÃ],L_TM[CHỈ TIÊU],\"-\")","v":"Doanh thu bán hàng"}]
["Tập đoàn",null,"002_",{"$f":"IF(L_Map[[#This Row],[MÃ BC]]<>\"\",COUNTIFS(L_Map[MÃ BC],L_Map[[#This Row],[MÃ BC]]),0)","v":1},"312_",{"$f":"IF(L_Map[[#This Row],[MÃ TM]]<>\"\",COUNTIFS(L_Map[MÃ TM],L_Map[[#This Row],[MÃ TM]]),0)","v":1},{"$f":"IF(_xlfn.XLOOKUP(L_Map[[#This Row],[MÃ TM]],L_TM[MÃ],L_TM[BCR],0),1,0)","v":0},{"$f":"_xlfn.XLOOKUP(L_Map[[#This Row],[MÃ BC]],L_FS[MÃ],L_FS[CHỈ TIÊU],\"-\")","v":"Các khoản giảm trừ"},{"$f":"_xlfn.XLOOKUP(L_Map[[#This Row],[MÃ TM]],L_TM[MÃ],L_TM[CHỈ TIÊU],\"-\")","v":"Giảm trừ doanh thu"}]
[null,null,"011_",{"$f":"IF(L_Map[[#This Row],[MÃ BC]]<>\"\",COUNTIFS(L_Map[MÃ BC],L_Map[[#This Row],[MÃ BC]]),0)","v":2},"320_",{"$f":"IF(L_Map[[#This Row],[MÃ TM]]<>\"\",COUNTIFS(L_Map[MÃ TM],L_Map[[#This Row],[MÃ TM]]),0)","v":1},{"$f":"IF(_xlfn.XLOOKUP(L_Map[[#This Row],[MÃ TM]],L_TM[MÃ],L_TM[BCR],0),1,0)","v":0},{"$f":"_xlfn.XLOOKUP(L_Map[[#This Row],[MÃ BC]],L_FS[MÃ],L_FS[CHỈ TIÊU],\"-\")","v":"Giá vốn hàng bán"},{"$f":"_xlfn.XLOOKUP(L_Map[[#This Row],[MÃ TM]],L_TM[MÃ],L_TM[CHỈ TIÊU],\"-\")","v":"Giá vốn hàng bán"}]
[null,null,"011_",{"$f":"IF(L_Map[[#This Row],[MÃ BC]]<>\"\",COUNTIFS(L_Map[MÃ BC],L_Map[[#This Row],[MÃ BC]]),0)","v":2},"370_",{"$f":"IF(L_Map[[#This Row],[MÃ TM]]<>\"\",COUNTIFS(L_Map[MÃ TM],L_Map[[#This Row],[MÃ TM]]),0)","v":3},{"$f":"IF(_xlfn.XLOOKUP(L_Map[[#This Row],[MÃ TM]],L_TM[MÃ],L_TM[BCR],0),1,0)","v":0},{"$f":"_xlfn.XLOOKUP(L_Map[[#This Row],[MÃ BC]],L_FS[MÃ],L_FS[CHỈ TIÊU],\"-\")","v":"Giá vốn hàng bán"},{"$f":"_xlfn.XLOOKUP(L_Map[[#This Row],[MÃ TM]],L_TM[MÃ],L_TM[CHỈ TIÊU],\"-\")","v":"Chi phí SXKD theo yếu tố"}]
["Thông tin công ty",null,"022_",{"$f":"IF(L_Map[[#This Row],[MÃ BC]]<>\"\",COUNTIFS(L_Map[MÃ BC],L_Map[[#This Row],[MÃ BC]]),0)","v":1},"331_",{"$f":"IF(L_Map[[#This Row],[MÃ TM]]<>\"\",COUNTIFS(L_Map[MÃ TM],L_Map[[#This Row],[MÃ TM]]),0)","v":1},{"$f":"IF(_xlfn.XLOOKUP(L_Map[[#This Row],[MÃ TM]],L_TM[MÃ],L_TM[BCR],0),1,0)","v":0},{"$f":"_xlfn.XLOOKUP(L_Map[[#This Row],[MÃ BC]],L_FS[MÃ],L_FS[CHỈ TIÊU],\"-\")","v":"Doanh thu hoạt động tài chính"},{"$f":"_xlfn.XLOOKUP(L_Map[[#This Row],[MÃ TM]],L_TM[MÃ],L_TM[CHỈ TIÊU],\"-\")","v":"Doanh thu tài chính"}]
{"$rows_left_out":107}
{"sheet":"Dòng tiền","index":6,"n_rows":54,"n_cols":8,"rows_kept":54,"cut":false,"hidden":false,"merged":[[0,0,3,0]]}
[{"$f":"'✅'!A1","v":"Tasco Group"}]
[]
[null,null,null,"CHỈ TIÊU DÒNG TIỀN"]
[null,null,null,null,null,"⏬"]
[{"$f":"'Công ty'!A5","v":"BCTC hợp nhất"},null,"MÃ","CHỈ TIÊU","NHÓM","CFⁿ",null,"Mã trùng"]
[null,null,"01_","Lợi nhuận trước thuế","KD gián tiếp",true,null,{"$f":"_Trùng(L_CF[MÃ])","v":"01_"}]
[null,null,"_","ĐIỀU CHỈNH CHO CÁC KHOẢN",null,null,null,"02_"]
["Tập đoàn",null,"02_","Khấu hao tài sản cố định và BĐSĐT","KD gián tiếp",true,null,"03_"]
[null,null,"02ᵇ","Khấu hao tài sản sinh học","KD gián tiếp",true,null,"04_"]
["Danh mục công ty",null,"02ᶜ","Phân bổ lợi thế thương mại","KD gián tiếp",true,null,"05_"]
{"$rows_left_out":45}
{"sheet":"Tập đoàn","index":7,"n_rows":28,"n_cols":12,"rows_kept":28,"cut":false,"hidden":false,"merged":[[0,0,3,0]]}
[{"$f":"'✅'!A1","v":"Tasco Group"}]
[]
[null,null,"TẬP ĐOÀN"]
[]
["BCTC hợp nhất²",null,"TẬP ĐOÀN","CTY MẸ","KH CTY MẸ","_","KH CTY MẸ",null,{"$f":"_xlfn.LET(_xlpm.a,_xlfn.TEXTJOIN(\";\",TRUE,L_TĐ[TẬP ĐOÀN]),_xlpm.b,L_TĐ[TẬP ĐOÀN],_xlpm.c,ROWS(_xlpm.a),_xlpm.d,ROWS(_xlpm.b),_xlpm.e,_xlpm.c+_xlpm.d,IF(_xlfn.SEQUENCE(_xlpm.e)<=_xlpm.c,INDEX(_xlpm.a,_xlfn.SEQUENCE(_xlpm.c),{1}),INDEX(_xlpm.b,_xlfn.SEQUENCE(_xlpm.e)-_xlpm.c,{1})))","v":"TASCOᴳ;TASCOAUTOᴳ;SVCᴳ;SGFᴳ;SVCHNᴳ;SVCDNᴳ;BTFᴳ;TGPᴳ;CARPLAᴳ;HSHᴳ;MDNᴳ;TLTKᴳ;DNPᴳ;DNPWᴳ"},null,"Kiểm tra trùng","Kiểm tra lồng"]
[null,null,"TASCOᴳ","100_",{"$f":"_xlfn.XLOOKUP(L_TĐ[[#This Row],[CTY MẸ]],L_CTY[MÃ],L_CTY[KÝ HIỆU])","v":"TASCO"},null,{"$f":"_xlfn.XLOOKUP(L_TĐ[CTY MẸ],L_CTY[MÃ],L_CTY[KÝ HIỆU],\"-\")","v":"TASCO"},null,"TASCOᴳ",null,{"$f":"_Trùng(L_TĐ[TẬP ĐOÀN])","v":"null"},{"$f":"_Lồng(L_TĐ[TẬP ĐOÀN])","v":"null"}]
[null,null,"TASCOAUTOᴳ","200_",{"$f":"_xlfn.XLOOKUP(L_TĐ[[#This Row],[CTY MẸ]],L_CTY[MÃ],L_CTY[KÝ HIỆU])","v":"TASCOAUTO"},null,"TASCOAUTO",null,"TASCOAUTOᴳ"]
["Tập đoàn",null,"SVCᴳ","300_",{"$f":"_xlfn.XLOOKUP(L_TĐ[[#This Row],[CTY MẸ]],L_CTY[MÃ],L_CTY[KÝ HIỆU])","v":"SVC"},null,"SVC",null,"SVCᴳ"]
[null,null,"SGFᴳ","311_",{"$f":"_xlfn.XLOOKUP(L_TĐ[[#This Row],[CTY MẸ]],L_CTY[MÃ],L_CTY[KÝ HIỆU])","v":"SGF"},null,"SGF",null,"SGFᴳ"]
["Danh mục công ty",null,"SVCHNᴳ","314_",{"$f":"_xlfn.XLOOKUP(L_TĐ[[#This Row],[CTY MẸ]],L_CTY[MÃ],L_CTY[KÝ HIỆU])","v":"SVCHN"},null,"SVCHN",null,"SVCHNᴳ"]
{"$rows_left_out":19}
{"sheet":"Vốn vay","index":8,"n_rows":35,"n_cols":10,"rows_kept":35,"cut":false,"hidden":false,"merged":[[0,0,3,0]]}
[{"$f":"'✅'!A1","v":"Tasco Group"}]
[]
[null,null,"ĐỐI TƯỢNG VAY",null,null,"ĐỐI TƯỢNG VAY",null,"NGÂN HÀNG"]
[]
[{"$f":"'Công ty'!A5","v":"BCTC hợp nhất"},null,"VAY / NHÓM","LOẠI",null,"VAY / ĐỐI TƯỢNG",null,"VAY / NGÂN HÀNG",null,"NHÓM ĐỐI TƯỢNG VAY"]
[null,null,"Vay ngắn hạn","Ngắn hạn",null,"Ngân hàng",null,"Ngân hàng SinoPac",null,"Vay ngân hàng "]
[null,null,"Vay dài hạn đến hạn trả ","Ngắn hạn",null,"Tổ chức khác",null,"Ngân hàng TNHH MTV Standard Chartered Việt Nam",null,"Vay cá nhân và tổ chức khác"]
["Tập đoàn",null,"Nợ thuê tài chính đến hạn trả ","Ngắn hạn",null,"Cá nhân",null,"Ngân hàng TMCP Công Thương Việt Nam (Vietinbank)",null,"Trái phiếu ngắn hạn"]
[null,null,"Trái phiếu ngắn hạn","Ngắn hạn",null,"Bên liên quan",null,"Ngân hàng TMCP Tiên Phong (TPBank)",null,"Vay dài hạn đến hạn trả"]
["Danh mục công ty",null,"Trái phiếu dài hạn đến hạn trả ","Ngắn hạn",null,null,null,"Ngân Hàng TMCP Phát Triển Việt Nam (VDB)",null,"Nợ thuê tài chính đến hạn trả"]
{"$rows_left_out":26}
{"sheet":"Khác","index":9,"n_rows":36,"n_cols":16,"rows_kept":36,"cut":false,"hidden":false,"merged":[[0,0,3,0]]}
[{"$f":"'✅'!A1","v":"Tasco Group"}]
[]
[null,null,"LĨNH VỰC",null,"KHU VỰC",null,"KỲ BÁO CÁO",null,null,null,"BÊN LIÊN QUAN",null,null,null,"RÚT GỌN TÊN"]
[]
[{"$f":"'Công ty'!A5","v":"BCTC hợp nhất"},null,"LĨNH VỰC",null,"KHU VỰC",null,"KỲ BÁO CÁO","Cả năm",null,{"$f":"(YEAR(TODAY())-2000)*100","v":2600},"BÊN LIÊN QUAN","TÊN KHÁCH HÀNG","PHÂN LOẠI",null,"Đổi từ","Sang"]
[null,null,"Hoạt động xây lắp",null,"Miền Bắc",null,{"$f":"\"Q\"&J6","v":"Q2501"},{"$f":"IF(RIGHT(L_KY[[#This Row],[KỲ BÁO CÁO]],1)+0=4,TRUE,FALSE)","v":false},null,{"$f":"J$5-100+1","v":2501},null,null,null,null,"Khách hàng","KH"]
[null,null,"Kinh doanh BĐS, dự án",null,"Miền Nam",null,"Q2502",{"$f":"IF(RIGHT(L_KY[[#This Row],[KỲ BÁO CÁO]],1)+0=4,TRUE,FALSE)","v":false},null,{"$f":"J$5-100+2","v":2502},null,null,null,null,"Tập đoàn","TĐ"]
["Tập đoàn",null,"Mua bán hàng hóa",null,"Miền Trung",null,"Q2503",{"$f":"IF(RIGHT(L_KY[[#This Row],[KỲ BÁO CÁO]],1)+0=4,TRUE,FALSE)","v":false},null,{"$f":"J$5-100+3","v":2503},null,null,null,null,"Tổng công ty","TCT"]
[null,null,"Nước sạch MT",null,null,null,"Q2504",{"$f":"IF(RIGHT(L_KY[[#This Row],[KỲ BÁO CÁO]],1)+0=4,TRUE,FALSE)","v":true},null,{"$f":"J$5-100+4","v":2504},null,null,null,null,"Tổng cty","TCT"]
["Danh mục công ty",null,"Hạ tầng nước",null,null,null,"Q2601",{"$f":"IF(RIGHT(L_KY[[#This Row],[KỲ BÁO CÁO]],1)+0=4,TRUE,FALSE)","v":false},null,{"$f":"J$5+1","v":2601},null,null,null,null,"Công ty","Cty"]
{"$rows_left_out":27}
{"sheet":"↓","index":10,"n_rows":175,"n_cols":14,"rows_kept":175,"cut":false,"hidden":true,"merged":[]}
["CHỌN",null,"TẬP ĐOÀN","BCTC","NHÓM TM","CÔNG TY","FS","BS","PL","TMBC","CF","LĨNH VỰC","KHU VỰC","KỲ BÁO CÁO"]
[true,{"$f":"A2:A3","v":true},{"$f":"L_TĐ[TẬP ĐOÀN]","v":"TASCOᴳ"},{"$f":"_xlfn.UNIQUE(L_FS[KHOẢN MỤC])","v":"_"},{"$f":"NH_TM[NH TM]","v":"N1"},{"$f":"_xlfn.LET(_xlpm.a,L_CTY[MÃ],_xlpm.a&IF(Chọn_mã_có_tên,\";\"&_xlfn.XLOOKUP(_xlpm.a,_xlpm.a,L_CTY[KÝ HIỆU]),\"\"))","v":"100_;TASCO"},{"$f":"_xlfn.LET(_xlpm.a,_xlfn._xlws.FILTER(L_FS[MÃ],L_FS[HT]=TRUE),_xlpm.a&IF(Chọn_mã_có_tên,\";\"&_xlfn.XLOOKUP(_xlpm.a,L_FS[MÃ],L_FS[CHỈ TIÊU]),\"\"))","v":"000_;Tài khoản ngoại bảng"},{"$f":"_xlfn.LET(_xlpm.a,_xlfn._xlws.FILTER(L_FS[MÃ],(L_FS[BS]<>0)*(L_FS[HT]=TRUE)),_xlpm.a&IF(Chọn_mã_có_tên,\";\"&_xlfn.XLOOKUP(_xlpm.a,L_FS[MÃ],L_FS[CHỈ TIÊU]),\"\"))","v":"111_;Tiền"},{"$f":"_xlfn.LET(_xlpm.a,_xlfn._xlws.FILTER(L_FS[MÃ],(L_FS[PL]<>0)*(L_FS[HT]=TRUE)),_xlpm.a&IF(Chọn_mã_có_tên,\";\"&_xlfn.XLOOKUP(_xlpm.a,L_FS[MÃ],L_FS[CHỈ TIÊU]),\"\"))","v":"001_;Doanh thu bán hàng & cung cấp dịch vụ"},{"$f":"_xlfn.LET(_xlpm.a,L_TM[MÃ],_xlpm.a&IF(Chọn_mã_có_tên,\";\"&_xlfn.XLOOKUP(_xlpm.a,_xlpm.a,L_TM[CHỈ TIÊU]),\"\"))","v":"010_;Tiền và tương đương tiền"},{"$f":"_xlfn.LET(_xlpm.a,L_CF[MÃ],_xlpm.a&IF(Chọn_mã_có_tên,_xlfn.XLOOKUP(_xlpm.a,_xlpm.a,L_CF[CHỈ TIÊU]),\"\"))","v":"01_Lợi nhuận trước thuế"},{"$f":"L_LV[LĨNH VỰC]","v":"Hoạt động xây lắp"},{"$f":"L_KV[KHU VỰC]","v":"Miền Bắc"},{"$f":"L_KY[KỲ BÁO CÁO]","v":"Q2501"}]
[false,false,"TASCOAUTOᴳ","KQKD","N2","173_;CPVETC","001_;Doanh thu bán hàng & cung cấp dịch vụ","112_;Các khoản tương đương tiền","002_;Các khoản giảm trừ","021_;Đầu tư nắm giữ đến ngày đáo hạn ngắn hạn","_ĐIỀU CHỈNH CHO CÁC KHOẢN","Kinh doanh BĐS, dự án","Miền Nam","Q2502"]
[null,null,"SVCᴳ","TS ngắn","N3","186_;LAND","002_;Các khoản giảm trừ","121_;Chứng khoán kinh doanh","011_;Giá vốn hàng bán","022_;Đầu tư nắm giữ đến ngày đáo hạn dài hạn","02_Khấu hao tài sản cố định và BĐSĐT","Mua bán hàng hóa","Miền Trung","Q2503"]
[null,null,"SGFᴳ","TS dài","N4","114_;BAOHIEM","011_;Giá vốn hàng bán","122_;Dự phòng giảm giá chứng khoán kinh doanh *","021_;Lãi/lỗ bán, thanh lý BĐS đầu tư","023_;Đầu tư vào công ty con","02ᵇKhấu hao tài sản sinh học","Nước sạch MT",null,"Q2504"]
[null,null,"SVCHNᴳ","Nợ ngắn","N5","185_;BOTH","021_;Lãi/lỗ bán, thanh lý BĐS đầu tư","123_;Đầu tư nắm giữ đến ngày đáo hạn ngắn hạn","022_;Doanh thu hoạt động tài chính","024_;Đầu tư vào công ty liên kết","02ᶜPhân bổ lợi thế thương mại","Hạ tầng nước",null,"Q2601"]
[null,null,"SVCDNᴳ","Nợ dài","N6","151_;TAS6","022_;Doanh thu hoạt động tài chính","124_;Dự phòng đầu tư nắm giữ đến ngày đáo hạn ngắn hạn *","023_;Chi phí tài chính","025_;Đầu tư góp vốn vào đơn vị khác","03_Các khoản dự phòng","Vật liệu xây dựng",null,"Q2602"]
[null,null,"BTFᴳ","Vốn khác","BP","171_;TASQB","023_;Chi phí tài chính","125_;Đầu tư ngắn hạn khác","025_;Chi phí bán hàng","026_;Chứng khoán kinh doanh","04_(Lãi)/lỗ CLTG do đánh giá lại các khoản mục tiền tệ gốc ngoại tệ","Đồ gia dụng",null,"Q2603"]
[null,null,"TGPᴳ","Vốn góp","N¹¹","157_;TASHP","024_;- Trong đó: chi phí đi vay","126_;Dự phòng tổn thất các khoản đầu tư ngắn hạn khác *","026_;Chi phí quản lý doanh nghiệp","027_;Dự phòng giảm giá chứng khoán kinh doanh *","05_(Lãi)/lỗ từ hoạt động đầu tư, tài chính","Bao bì",null,"Q2604"]
[null,null,"CARPLAᴳ",null,"N¹²","147_;TASNT","025_;Chi phí bán hàng","131_;Phải thu ngắn hạn của khách hàng","027_;Phần lãi (lỗ) trong cty liên kết, liên doanh","028_;Dự phòng đầu tư tài chính dài hạn *","06_Chi phí đi vay","Khác"]
{"$rows_left_out":166}
{"sheet":"Công ty","index":11,"n_rows":179,"n_cols":14,"rows_kept":179,"cut":false,"hidden":false,"merged":[[0,0,3,0]]}
[{"$f":"'✅'!A1","v":"Tasco Group"}]
[]
[null,null,null,null,"DANH MỤC CÔNG TY"]
[null,null,{"$f":"COUNTA(L_CTY[MÃ])","v":174}]
["BCTC hợp nhất",null,"MÃ","KÝ HIỆU","TÊN CÔNG TY","MÃ SỐ THUẾ","GHI CHÚ","NỘI BỘ","TT",null,"Trùng mã","Lồng mã","Trùng KH","Lồng KH"]
[null,null,"100_","TASCO","Công ty CP Tasco","0600264117_",null,"Yes",1,null,{"$f":"_Trùng(L_CTY[MÃ])","v":"null"},{"$f":"_Lồng(L_CTY[MÃ])","v":"null"},{"$f":"_Trùng(L_CTY[KÝ HIỆU])","v":"null"},{"$f":"_Lồng(L_CTY[KÝ HIỆU])","v":"TASCO"}]
[null,null,"173_","CPVETC","Công ty CP VETC","0106858609_",null,"Yes",2,null,null,null,null,"BOTH"]
["Tập đoàn",null,"186_","LAND","Công ty TNHH Tasco Land","0109935403_",null,"Yes",3,null,null,null,null,"SVC"]
[null,null,"114_","BAOHIEM","Công ty TNHH Bảo hiểm Tasco","0302391670_",null,"Yes",4,null,null,null,null,"GLYNK"]
["Danh mục công ty",null,"185_","BOTH","Công ty TNHH MTV Tasco BOT","0110375308_",null,"Yes",5,null,null,null,null,"DNP"]
{"$rows_left_out":170}
{"sheet":"~ctbc","index":12,"n_rows":246,"n_cols":8,"rows_kept":246,"cut":false,"hidden":false,"merged":[]}
["FILE:","https://docs.google.com/spreadsheets/d/e/2PACX-1vT_xdizaM6xU82PsBTJ7T7HATJlPSLeVfWs_vFQyJPSH8UMu-X72xvw4pGSxe1IUQ/pub?output=xlsx","SQL:","SELECT * FROM [ctbc$A1:E]",null,null,null," "]
["Opt:","HEAD filter","To:",{"$f":"[1]!QRange(A5)","v":"A5"}]
[]
[]
["MÃ TRƯỚC","TÊN TRƯỚC","MÃ SAU","TÊN SAU","THAY ĐỔI"]
["000_","Tài khoản ngoại bảng","000_","Tài khoản ngoại bảng","giữ nguyên"]
["001_","Doanh thu bán hàng & cung cấp dịch vụ","001_","Doanh thu bán hàng & cung cấp dịch vụ","giữ nguyên"]
["002_","Các khoản giảm trừ","002_","Các khoản giảm trừ","giữ nguyên"]
["011_","Giá vốn hàng bán","011_","Giá vốn hàng bán","giữ nguyên"]
[null,null,"021_","Lãi/lỗ bán, thanh lý BĐS đầu tư","thêm mã mới"]
{"$rows_left_out":237}
{"sheet":"~cttm","index":13,"n_rows":150,"n_cols":5,"rows_kept":150,"cut":false,"hidden":false,"merged":[]}
["FILE:",{"$f":"'~ctbc'!B1","v":"https://docs.google.com/spreadsheets/d/e/2PACX-1vT_xdizaM6xU82PsBTJ7T7HATJlPSLeVfWs_vFQyJPSH8UMu-X72xvw4pGSxe1IUQ/pub?output=xlsx"},"SQL:","SELECT * FROM [cttm$A1:E]"]
["Opt:","HEAD filter","To:",{"$f":"[1]!QRange(A5)","v":"A5"}]
[]
[]
["MÃ TRƯỚC","CHỈ TIÊU TRƯỚC","MÃ SAU","CHỈ TIÊU ᴿAU","THAY ĐỔI"]
["010_","Tiền và tương đương tiền","010_","Tiền và tương đương tiền","giữ nguyên"]
["021_","Đầu tư nắm giữ đến ngày đáo hạn ngắn hạn","021_","Đầu tư nắm giữ đến ngày đáo hạn ngắn hạn","giữ nguyên"]
["022_","Đầu tư nắm giữ đến ngày đáo hạn dài hạn","022_","Đầu tư nắm giữ đến ngày đáo hạn dài hạn","giữ nguyên"]
["023_","Đầu tư vào công ty con","023_","Đầu tư vào công ty con","giữ nguyên"]
["024_","Đầu tư vào công ty liên kết","024_","Đầu tư vào công ty liên kết","giữ nguyên"]
{"$rows_left_out":140}